[Nagiosplug-devel] Compiling latest snapshot on solaris 7

Ben O'Hara bohara at gmail.com
Thu Nov 23 12:51:58 CET 2006

Hi Guys,

Im trying to compile to compile the latest snapshot of the plugins on
Solaris 7 but im getting the following error when trying to make

bash-3.1# make
make  all-recursive
make[1]: Entering directory `/apps/src/nagios-plugins-HEAD-200611161252'
Making all in lib
make[2]: Entering directory `/apps/src/nagios-plugins-HEAD-200611161252/lib'
make  all-recursive
make[3]: Entering directory `/apps/src/nagios-plugins-HEAD-200611161252/lib'
Making all in tests
make[4]: Entering directory
make[4]: Nothing to be done for `all'.
make[4]: Leaving directory
make[4]: Entering directory `/apps/src/nagios-plugins-HEAD-200611161252/lib'
rm -f libcoreutils.a
false cru libcoreutils.a cloexec.o full-read.o full-write.o
safe-read.o safe-write.o xalloc-die.o error.o basename.o c-strtod.o
c-strtold.o exitfail.o open-safer.o creat-safer.o fsusage.o getopt.o
getopt1.o mountlist.o regex.o dup-safer.o fd-safer.o pipe-safer.o
make[4]: *** [libcoreutils.a] Error 1
make[4]: Leaving directory `/apps/src/nagios-plugins-HEAD-200611161252/lib'
make[3]: *** [all-recursive] Error 1
make[3]: Leaving directory `/apps/src/nagios-plugins-HEAD-200611161252/lib'
make[2]: *** [all] Error 2
make[2]: Leaving directory `/apps/src/nagios-plugins-HEAD-200611161252/lib'
make[1]: *** [all-recursive] Error 1
make[1]: Leaving directory `/apps/src/nagios-plugins-HEAD-200611161252'
make: *** [all] Error 2

Looking into it i think its trying to build lib/libcoreutils and
lin/libnagiosplug but they dont appear in the distribution.

Anyone got any ideas?



"A Scientist will earn a living by taking a really difficult problem
and spends many years solving it, an engineer earns a living by
finding really difficult problems and side stepping them"

More information about the Devel mailing list