[Nagiosplug-help] Compilation error.

Rubin Shoa robin at dealtime.com
Tue Jul 22 15:09:13 CEST 2003


When trying to compile the NRPE daemon on Sun OS5.8 
I receive the following compilation errors : 

> make all
cd ./src/; make ; cd ..
make[1]: Entering directory `/usr/local/nagios/libexec/nrpe-1.5/src'
gcc -g -O2 -DHAVE_CONFIG_H  -lnsl nrpe.c netutils.c -o nrpe
/usr/ccs/bin/as: "/var/tmp/ccLoPtQk.s", line 1199: error: unknown opcode ".subsection"
/usr/ccs/bin/as: "/var/tmp/ccLoPtQk.s", line 1199: error: statement syntax
/usr/ccs/bin/as: "/var/tmp/ccLoPtQk.s", line 1207: error: unknown opcode ".previous"
/usr/ccs/bin/as: "/var/tmp/ccLoPtQk.s", line 1207: error: statement syntax
make[1]: *** [nrpe] Error 1
make[1]: Leaving directory `/usr/local/nagios/libexec/nrpe-1.5/src'

*** Compile finished ***

I wonder if you can help me on this issue.

Thanks for the help,

Rubin Shoa.

-------------- next part --------------
An HTML attachment was scrubbed...
URL: <https://www.monitoring-plugins.org/archive/help/attachments/20030722/3f971300/attachment.html>

More information about the Help mailing list