[Nagiosplug-help] Build error for nagios-plugins-HEAD-200607191152 on Solaris 9 Sparc

gthompson at carolina.rr.com gthompson at carolina.rr.com
Wed Jul 19 22:47:50 CEST 2006

I configured this with largefile support turned off because I got that
error first.

check_http.c: In function `process_arguments':
check_http.c:161: error: `CHAR_MAX' undeclared (first use in this function)
check_http.c:161: error: (Each undeclared identifier is reported only once
check_http.c:161: error: for each function it appears in.)
check_http.c:162: error: enumerator value for `INVERT_REGEX' not integer
make[2]: *** [check_http.o] Error 1
make[2]: Leaving directory `/usr/local/nagios-plugins-new/plugins'
make[1]: *** [all-recursive] Error 1
make[1]: Leaving directory `/usr/local/nagios-plugins-new'
make: *** [all] Error 2

George Thompson

mail2web - Check your email from the web at
http://mail2web.com/ .

More information about the Help mailing list